{"text_format":"1","workbook":"xlsx","n_sheets":12,"sheets":["Introduction","Results","Recommendations","I - Regulation","II - Resources","III - Compliance Processes","Compl processes list","Definitions","Recom list","Reg list","Res list","Scorecard lists"],"not_rendered":{"charts":2,"images":1,"macros":1,"external_links":0,"defined_names":3,"comments":0,"pivot_tables":0},"unopened":[],"bounds":{"document_bytes":16777216,"sheet_cells":100000,"rows_first":2000,"rows_last":500,"rows_between":2000,"halvings":0,"cell_chars":16384,"cell_head_chars":4096},"cells_cut":0,"cells_raw":0,"read":"whole","date_system":"1900"}

{"sheet":"Introduction","index":0,"n_rows":15,"n_cols":6,"rows_kept":15,"cut":false,"hidden":false,"merged":[[6,1,12,16],[14,1,37,16]]}
[]
[]
[null,null,null,null,null,"Non-Compliance Risk Assessment Tool (NC-RAT)"]
[]
[]
[null,"INTRODUCTION"]
[null,"Compliance protects national markets from non-compliant products and safeguards benefits from adopted energy efficiency and quality policies. Despite playing a key role in policy implementation, compliance is often overlooked or delayed by the governments, funders and development partners. One reason is that significant efforts and resources are required to design and enforce robust compliance frameworks, but it is challenging to evaluate associated impacts.  There is no clear methodology to estimate the benefits of compliance such as reduced number of non-compliant products on the market to provide a compelling reasoning for the investment in compliance-related initiatives. Testing a large number of products from the market to assess non-compliance rate is also cost prohibitive for many. \n\nRecognizing the challenge that governments face to measure market non-compliance rate and build the case for compliance, CLASP has developed Non-Compliance Risk Assessment Tool (NC-RAT). The Tool serves an initial step for the  policy makers and others to:\n\n        • Assess national compliance processes for product energy efficiency and quality programs, and associated market non-compliance risk\n        • Advance policy compliance and enforcement by identifying specific  gaps, prioritize investment in compliance processes with greatest impact to strengthening them\n        • Build a case for investment in policy compliance and enforcement initiatives\n        • Track progress/improvement of compliance efforts, e.g.  conduct initial assessment to set the benchmark and assess the compliance program regularly, i.e. on annual basis.\n\nNC-RAT is an easy-to-use Tool that is based on qualitative assessment  of  national compliance program and organized under five Indicators: Regulation, Resources, Certification & Registration, Market Surveillance & Enforcement, and Compliance Communication. Each Indicator includes relevant questions for the user to respond to, based on which the Tool calculates scores 1) for each Indicator and 2) a corresponding overall score for market non-compliance risk. The Tool also provides initial recommendations for strengthening compliance program, which are informed by gap assessment based on responses.\n\nThe estimated time for completing this assessment is 30-60 minutes if the user has the necessary information at hand. \n\nFor questions and inquiries on the Tool, suggestions for improvement, sharing country's assessment results, etc. please contact Lina Kelpsaite at lkelpsaite@clasp.ngo. For additional compliance resources, please visit  clasp.ngo. "]
[]
{"$rows_left_out":8}
{"sheet":"Results","index":1,"n_rows":34,"n_cols":14,"rows_kept":34,"cut":false,"hidden":false,"merged":[[16,5,17,7],[18,5,18,7],[0,10,1,12],[0,0,1,3],[3,2,3,3],[4,2,4,3],[5,2,5,3],[9,1,9,2],[10,1,10,2]]}
["MARKET NON-COMPLIANCE RISK ASSESSMENT RESULTS "]
[]
[]
[null,"Country (select)",null,null,null,"Name (write in):"]
[null,"Assessment Year (select)",null,null,null,"Role (write in):"]
[null,"Product Energy Source (select)",null,null,null,"Organization (write in):"]
[null,null,null,null,null,"Date (write in):"]
[]
{"$rows_left_out":27}
{"sheet":"Recommendations","index":2,"n_rows":28,"n_cols":17,"rows_kept":28,"cut":false,"hidden":false,"merged":[[0,0,0,5],[1,0,1,5]]}
["RECOMMENDATIONS"]
[" Provided here are recommendations for improving compliance program to minimize country's market risk of non-compliance. These recommedations are informed by the assessment results in this Tool and  are organized by compliance indicators and sub-indicators. The recommended actions are categorised by the priority level:\n   - Key Priority recommendations are provided for the sub-indicators that  require significant improvement. This corresponds to a gap of above 40% from the max possible sub-indicator score.\n   - Secondary Priority recommendations  are provided for sub-indicators under which program performs quite well but additional improvements can be made. This corresponds to a gap of under 40% as compared to max sub-indicator score.\n\nThe areas that perform as per compliance best practices indicated in this assessment, there is No improvement to be made.\n\nUse drop-down menu below to select Priority level. The recommended actions for improving and strengthening compliance program, level of effort, suggested stakeholders are displayed in the table below.  Please contact CLASP compliance team at lkelpsaite@clasp.ngo if you have questions about recommendations or are interested in support for compliance program.",null,null,null,null,null,null,null,null,"Indicator","Evaluation  Score","Max score","Gap","Needs improvement"]
[null,null,null,null,null,null,null,null,null,"Regulation",{"$f":"Results!C15","v":0},1,{"$f":"(L3-K3)/L3","v":1},{"$f":"VLOOKUP(O6, J10:N12,5)","v":"Key Priority"}]
[null,"Priority Level  (select)",null,null,null,null,null,null,null,"Resources",{"$f":"Results!C16","v":0},{"$f":"SUM(L13:L18)","v":1},{"$f":"(L4-K4)/L4","v":1},{"$f":"VLOOKUP(O6, J13:N18,5)","v":"Key Priority"}]
[null,null,null,null,null,null,null,null,null,{"$f":"'III - Compliance Processes'!A18","v":"Processes - Certification & Registration"},{"$f":"Results!C17","v":0},{"$f":"SUM(L19:L20)","v":1},{"$f":"(L5-K5)/L5","v":1},{"$f":"VLOOKUP(O6, J19:N20,5)","v":"Key Priority"},"No Improvement"]
[null,null,null,null,null,null,null,null,null,{"$f":"Results!B18","v":"Processes - Market Surveillance & Enforcement"},{"$f":"Results!C18","v":0},{"$f":"SUM(L21:L24)","v":1},{"$f":"(L6-K6)/L6","v":1},{"$f":"VLOOKUP(O6, J21:N24,5)","v":"Key Priority"},"Secondary Priority"]
[null,"Key Improvement Areas",null,null,null,null,null,null,null,{"$f":"Results!B19","v":"Compliance Communication"},{"$f":"Results!C19","v":0},{"$f":"SUM(L25:L26)","v":1},{"$f":"(L7-K7)/L7","v":1},{"$f":"VLOOKUP(O6, J25:N26,5)","v":"Key Priority"},"Not Priority"]
[null,"Indicator","Sub-Indicator","Recommendation ","Level of Effort","Who?"]
{"$rows_left_out":21}
{"sheet":"I - Regulation","index":3,"n_rows":31,"n_cols":9,"rows_kept":31,"cut":false,"hidden":false,"merged":[[9,0,9,1],[11,0,11,3],[12,0,12,2],[17,0,17,2],[22,0,22,2],[15,1,15,2],[14,1,14,2],[13,1,13,2],[16,1,16,2],[0,0,1,2],[2,0,2,3],[6,0,6,2],[7,0,7,1],[8,0,8,1],[23,1,23,2],[19,1,19,2],[20,1,20,2],[21,1,21,2],[18,1,18,2]]}
[" REGULATORY FRAMEWORK",null,null,"INDICATOR SCORE (out of 1)"]
[null,null,null,{"$f":"IF(C9='Reg list'!A5,0,(SUM(F14:F24)-0)/(SUM(E14:E24)-0))","v":0}]
["This indicator evaluates the status of country's regulations and provisions for compliance processes, i.e. whether regulations cover all necessary provisions, whether the country has adminstrative guidelines to complement the regulations, etc. "]
[]
[null,"Reset response cells?",null," Please select \"Yes\" each time you would like to clear resposes"]
[]
["Initial Assessment"]
["Question  I",null,{"$f":"'Reg list'!A2","v":"Does the country have regulation (or provisions) to implement and enforce product energy efficiency or quality policies, including offences, penalties, etc.?"}]
{"$rows_left_out":24}
{"sheet":"II - Resources","index":4,"n_rows":43,"n_cols":9,"rows_kept":43,"cut":false,"hidden":false,"merged":[[7,0,7,2],[6,0,6,2],[0,0,1,2],[15,1,15,2],[16,1,16,2],[2,0,2,3],[8,1,8,2],[9,1,9,2],[10,1,10,2],[11,1,11,2],[12,1,12,2],[18,1,18,2],[19,1,19,2],[13,0,13,2],[17,0,17,2],[34,4,34,6],[14,1,14,2]]}
["RESOURCES",null,null,"INDICATOR SCORE (out of 1)"]
[null,null,null,{"$f":"IF('I - Regulation'!C9='Reg list'!A5,0,(SUM(F9:F20)-0)/(SUM(E9:E20)-0))","v":0}]
["This indicator evaluates the status of your country's financial, human, and infrastructure resources for enforcing policy compliance, i.e. whether the program has sufficient staff, budget and access to testing facilities. "]
[]
[null,"Reset response cells?",null," Please select \"Yes\" each time you would like to clear resposes"]
[]
["Assessing Avaiablity of Required Resources for Implementing Efficiency Policies for Products"]
["Institutional Framework and Human Capital",null,null,"Response - select applicable option","Max score","Question Score ","Adjusted score"]
{"$rows_left_out":36}
{"sheet":"III - Compliance Processes","index":5,"n_rows":91,"n_cols":9,"rows_kept":91,"cut":false,"hidden":false,"merged":[[56,0,56,1],[57,0,57,1],[58,0,58,1],[50,0,50,2],[51,1,51,2],[52,1,52,2],[53,1,53,2],[55,0,55,2],[0,0,1,1],[2,0,2,3],[11,0,11,1],[12,0,12,1],[13,0,13,1],[25,1,25,2],[78,4,78,6],[61,1,61,2],[62,1,62,2],[63,1,63,2],[64,1,64,2],[27,0,27,2],[28,0,28,1],[29,0,29,1],[30,0,30,1],[32,0,32,2],[60,0,60,2],[45,0,45,2],[46,0,46,1],[47,0,47,1],[48,0,48,1],[14,0,14,1],[16,0,16,3],[17,0,17,2],[37,1,37,2],[38,1,38,2],[18,1,18,2],[20,1,20,2],[19,1,19,2],[21,1,21,2],[22,1,22,2],[33,1,33,2],[34,1,34,2],[35,1,35,2],[36,1,36,2],[23,1,23,2],[24,1,24,2],[39,1,39,2],[40,1,40,2],[41,1,41,2],[42,1,42,2],[43,1,43,2]]}
["COMPLIANCE PROCESSES"]
[]
["This indicator evaluates the status of your country's compliance processes, i.e. product registration, market monitoring activities, etc. "]
[]
[null,null,null,"INDICATOR SCORE"]
[null,null,"Certification & Registration",{"$f":"IF('I - Regulation'!C9='Reg list'!A5,0,IF(C14='Compl processes list'!A5,0,(SUM(F19:F26)-0)/(SUM(E19:E26)-0)))","v":0}]
[null,null,"Market Surveillance and Enforcement",{"$f":"IF('I - Regulation'!C9='Reg list'!A5,0,IF(C30='Compl processes list'!E5,0,G56))","v":0}]
[null,null,"Compliance Communication",{"$f":"IF('I - Regulation'!C9='Reg list'!A5,0,IF(C58='Compl processes list'!I5,0,(SUM(F62:F65)-0)/(SUM(E62:E65)-0)))","v":0}]
{"$rows_left_out":84}
{"sheet":"Compl processes list","index":6,"n_rows":53,"n_cols":14,"rows_kept":53,"cut":false,"hidden":true,"merged":[[60,8,60,9],[60,10,60,11],[60,0,60,1],[60,2,60,3],[49,2,49,3],[60,6,60,7],[60,4,60,5]]}
["Compliance processes - gateaway question"]
["Has the country set up product market entry requirements and processes (e.g. product registration)?",null,"Action",null,"Does the program have market surveillance procedures and enforcement actions? ",null,"Action",null,"Does the program communicate compliance requirements, market surveillance actions, and compliance results to stakeholders? ",null,"Action",null,"Is regional or bi-lateral collaboration on compliance with other countries possible?","Action"]
["Yes",null,"Go to Question III.1",null,"Yes",null,"Go to Question III.9",null,"Yes",null,"Go to Question III.20",null,"Yes","Go to Question III.24"]
["Under development",null,"Go to Question III.1",null,"Under development",null,"Go to Question III.9",null,"Somewhat",null,"Go to Question III.20",null,"Somewhat","Go to Question III.24"]
["No",null,"Go to Question III-B (on Market Surveillance)",null,"No",null,"Go to Question III-C (on Communications)",null,"No",null,"Go to Question III-D (on Regional Collaboration)",null,"No","Go to Results tab"]
[]
["Certification and Registration"]
["Does the Regulator or certification body review test reports to confirm compliance with the regulatory requirements, before certifying products?",null,"Which products are registered in product registration system (database)?",null,"What type of product registration system (database)  is used to register products?",null,"What action is taken against suspicious or wrong product certification application (i.e. incomplete applications, applications with innaccuracies and errors, suspicious test reports, etc.)?",null,"If the country has labeling program, how is the energy or quality label generated? "]
{"$rows_left_out":46}
{"sheet":"Definitions","index":7,"n_rows":15,"n_cols":1,"rows_kept":15,"cut":false,"hidden":false,"merged":[[13,0,13,14],[14,0,14,14],[9,0,9,14],[10,0,10,14],[11,0,11,14],[12,0,12,14],[0,0,1,14],[5,0,5,14],[6,0,6,14],[7,0,7,14],[8,0,8,14],[2,0,2,14]]}
["DEFINITIONS"]
[]
["Here we provide definitions for common compliance terms used in this assessment."]
[]
[]
["Administrative Guidelines are a complementary to the legislation providing clear and consistent guidance to the energy efficiency compliance program administrators and stakeholders to better understand processes and requirements."]
["Certification  is the validation of performance by a third-party (i.e. not the product suppliers) in order to demonstrate that the product meets labelling or standards requirements, ensuring consistency, and giving credibility to claims about energy efficiency. In cases of Supplier's Declaration of Conformity, the certification is declared by the supplier."]
["Compliance  is a conformance to a rule, such as a law, policy, specification or standards. In this case conformance is to the requirements for all participants in the energy efficiency or quality program, as specified in relevant laws, regulations and associated administrative arrangements for appliances, lighting, and equipment."]
{"$rows_left_out":8}
{"sheet":"Recom list","index":8,"n_rows":22,"n_cols":8,"rows_kept":22,"cut":false,"hidden":true,"merged":[]}
[null,null,"Key Priority","High"]
[null,null,"Secondary Priority","Medium "]
[null,null,"No Improvement","Low"]
[]
["Indicator","Areas","Recommendation - Key Priority","Level of Effort - Key Priority","Who? -  Key priority","Recommendation - Secondary Priority","Level of Effort - Secondary Priority","Who - Secondary Priority"]
["Regulation","Regulations - Key Provisions","Adopt or revise the existing regulation with critical provisions such as roles and responsibilities, offences and penalties, which is foundational to effective policy compliance. ","Low"," - Relevant government agency(-ies)\n - Expert technical assistance ","Revise appropriate regulation(s) for policy enforcement to include missing key provisions such as roles and responsibilities, offences and penalties. ","Low"," - Relevant government agency(-ies)\n -  Expert technical assistance "]
["Regulation","Regulations - Additional Provisions","Adopt or revise the existing regulation with additional provisions for product ceritfication and registration and market surveillance powers, which are essential for effectively setting up  policy compliance processes. ","Low"," - Relevant government agency(-ies)\n - Expert technical assistance ","Revise appropriate regulation(s) to include missing provisions for product ceritfication and registration, and market surveillance powers, which are essential for effectively setting up policy compliance processes. ","Low"," - Relevant government agency(-ies)\n - Expert technical assistance "]
["Regulation","Other - Administrative Guidelines","Develop administrative guidance to complement the regulation that outlines in detail compliance processes and requirements.","Medium "," - Relevant government agency(-ies)\n - Expert technical assistance ","Ensure that available administrative guidance is comprehensive and clear for stakeholders. ","Low"," - Relevant government agency(-ies)\n - Expert technical assistance "]
{"$rows_left_out":15}
{"sheet":"Reg list","index":9,"n_rows":26,"n_cols":8,"rows_kept":26,"cut":false,"hidden":true,"merged":[[13,2,13,3]]}
["Regulatory Framework - gateaway question"]
["Does the country have regulation (or provisions) to implement and enforce product energy efficiency or quality policies, including offences, penalties, etc.?",null,"Action"]
["Yes",null,"Go to Question I.1"]
["The regulation is under development ",null,"Go to Question I.1"]
["No",null,"This assessment is not applicable for the country. You do not need to answer any further questions. To get more guidance and information on how to set up regulatory framework and compliance processes, please refer to the CLASP Guidebook and compliance resources on clasp.ngo."]
[]
["Key provisions"]
["Does the regulation identify and define roles and responsibilities of key actors (i.e. regulator/enforcement authority, product manufacturer, retailer, etc. )?",null,"Does the regulation identify and define potential offences? ",null,"Does the regulation provide a range of penalties or other enforcement actions for non-compliance? ",null,"Does the regulation define manufacturer, importer, and retailer requirements? "]
{"$rows_left_out":19}
{"sheet":"Res list","index":10,"n_rows":19,"n_cols":10,"rows_kept":19,"cut":false,"hidden":true,"merged":[]}
["Institutional Framework and Human Capital"]
["Has a Regulator been assigned responsibility for ensuring compliance with the regulations? ",null,"Is the Regulator actively implementing all their assigned responsibilities (ie. conformity assessment, market surveillance, enforcement, reporting, etc.)?",null,"Have the roles and responsibilities been clearly defined and assigned between agencies if there is a need for their support for compliance processes?",null,"Is compliance program sufficiently staffed? ",null,"Is compliance staff trained, knowledgeable, and able to execute their duties? "]
["Yes",2,"Yes",2,"Yes",1,"Yes",1,"Yes",1]
["In process",1,"The regulator performs some but not all responsibilities ",1,"Partially",0.5,"The program is partially staffed",0.5,"Partially",0.5]
["No",0,"Not yet or responsibilities have not been set yet",0,"No",0,"Not staffed at all",0,"No",0]
[null,null,null,null,null,null,"I don't know",0]
["Access to Infrastructure"]
["Does the energy efficiency program use a product registration system (database)?",null,"Does the Regulator have access to test facilities, in-country or abroad, to conduct verification testing of products?",null,"Does the team have the tools and physical resources they need to conduct compliance activities  (e.g. computers, mobile phones, etc.)? "]
{"$rows_left_out":12}
{"sheet":"Scorecard lists","index":11,"n_rows":96,"n_cols":10,"rows_kept":96,"cut":false,"hidden":true,"merged":[]}
[]
[null,"Country","Year","Products","Policy Instrument","Evaluation","Product Market","Compliance",null,"Product Energy Source"]
[null,"Algeria",2020,"Air Conditioner","Minimum Energy Performance Standards (MEPS)","Extremely High Non-Compliance Risk indicates that the likelihood of non-compliant products circulating the market is very high and of grave concern.","Imported","Yes","Yes","On-grid"]
[null,"Argentina",2021,"Refrigerator","Energy Labeling ","High Non-Compliance Risk indicates that the likelihood of non-compliant products circulating the market is high and of great concern.","Imported and Locally Manufactured","No ","No ","Off-grid"]
[null,"Australia",2022,"Lighting","MEPS and Energy Labeling ","Medium Non-Compliance Risk indicates that the likelihood of non-compliant products circulating the market is somewhat concerning.","Locally Manufactured","Under development","Don't know"]
[null,"Bahrain",2023,"Electric Motor",null,"Low Non-Compliance Risk indicates that the likelihood of non-compliant products circulating the market is relatively low."]
[null,"Bangladesh",2024,"Television",null,"Minimal Non-Compliance Risk indicates that the likelihood of non-compliant products circulating the market is very low."]
[null,"Barbados",2025,"Transformers",null,"Refer to CLASP Guidebook and Decision Tree for guidance on developing accompanying regulation and setting up policy compliance processes"]
{"$rows_left_out":88}